Gauges
type: Concept

RAIN GAUGES
type: Concept
change note: 2021-08-05 17:01:13.0 [sritz] insert AltLabel (id: null category: primary text: RAIN GAUGES language code: en);
definition: A RAIN GAUGE is an instrument that measures and records the level or levels of rain or precipitation. Group: Instrument_Details Entry_ID: RAIN GAUGES Group: Instrument_Identification Instrument_Category: In Situ/Laboratory Instruments Instrument_Class: Gauges Short_Name: RAIN GAUGES End_Group Group: Associated_Platforms Short_Name: SGO End_Group Creation_Date: 2007-07-10 End_Group
in scheme: instruments