Hypsometry
type: Concept
change note: 2021-12-02 14:56:36.0 [sritz] Insert Concept add broader relation (Hypsometry [6a2b291c-f78b-48c3-869f-9a4c8a40bc6c,835960] - GLACIER ELEVATION/ICE SHEET ELEVATION [83bd640d-cd05-49a8-9ec7-aab60820b126,834215]);
definition: elevation and depth measurements of features of the Earth’s surface made with respect to sea level
in scheme: sciencekeywords

GLACIER ELEVATION/ICE SHEET ELEVATION
type: Concept