U-BOURGOGNE/CRC
type: Concept
definition: The UB/CRC has compiled a tropical African rainfall dataset consisting of data from more than 600 stations (20 N to 35 S). This dataset is available for the 1951-1990 period south of the Sahara, on a 5 X 5 degree grid. This dataset is free to distribute to the scientific community. Summary Provided By: http://xena2-prod.ccrs.nrcan.gc.ca/gdp/search?action=fullMetadata&entryId=2266&entryLang=en&entryType=productCollection
in scheme: providers

ACADEMIC
type: Concept