FLUVIAL PROCESSES
type: Concept

ABRASION
type: Concept
change note: 2013-08-15 13:45:07.0 [tbs1979] insert Definition (id: null text: Mechanical scraping of a rock surface by friction between rocks and moving particles. language code: en);
change note: 2013-08-05 12:43:47.0 [tbs1979] Insert Concept add broader relation (ABRASION [6ae0d1f7-cc99-4da7-8446-e2dca16f546b,105363] - FLUVIAL PROCESSES [4b982bef-56fe-41e9-a131-af575a8fec6a,84331]);
definition: Mechanical scraping of a rock surface by friction between rocks and moving particles.
in scheme: sciencekeywords