USM/GOMA
type: Concept
definition: Welcome to the new NOAA Office of Ocean Exploration and Research (OER) Website! It is literally a work-in-progress; new articles and updates are coming in regularly. Ultimately, our intent is to provide you with an overview of the diverse audiences this Office serves, the products and services we provide, how we are organized, and the wide range of tools and resources we bring to bear to ensure success.
in scheme: providers

ACADEMIC
type: Concept