Earth Observation Satellites
type: Concept

CLARREO Pathfinder
type: Concept
change note: 2020-05-15 17:42:10.0 [sritz] insert Definition (id: null text: CLARREO Pathfinder (CPF) data will do this by taking highly accurate measurements of sunlight reflected by Earth and the Moon. These measurements, which will be anchored to international standards, will be five to ten times more accurate than those from existing sensors. CPF will have the unique ability to maintain its high accuracy throughout its lifetime. CPF will also showcase novel techniques in transferring its high accuracy to other sensors monitoring Earth. Higher accuracy means greater certainty in our measurements, which makes it possible to detect Earth’s subtle climate change trends decades sooner than otherwise. More Information: https://clarreo-pathfinder.larc.nasa.gov/ language code: en);
change note: 2020-05-15 17:40:32.0 [sritz] Insert Concept add broader relation (CLARREO Pathfinder [6bfd2526-e039-40e0-9abe-ac370f755d20,560143] - Earth Observation Satellites [3466eed1-2fbb-49bf-ab0b-dc08731d502b,541501]);
definition: CLARREO Pathfinder (CPF) data will do this by taking highly accurate measurements of sunlight reflected by Earth and the Moon. These measurements, which will be anchored to international standards, will be five to ten times more accurate than those from existing sensors. CPF will have the unique ability to maintain its high accuracy throughout its lifetime. CPF will also showcase novel techniques in transferring its high accuracy to other sensors monitoring Earth. Higher accuracy means greater certainty in our measurements, which makes it possible to detect Earth’s subtle climate change trends decades sooner than otherwise. More Information: https://clarreo-pathfinder.larc.nasa.gov/
in scheme: platforms