SURFACE TEMPERATURE
type: Concept

DEICED TEMPERATURE
type: Concept
change note: 2013-10-15 18:25:04.0 [saritz] updated definition update Definition (Temperature measured by the removal of ice through heating.); update Definition (EOSDIS Parameter Keyword Definitions, https://earthdata.nasa.gov/);
change note: 2013-09-04 14:03:25.0 [epneff] Move Concepts add broader relation (DEICED TEMPERATURE [6e923275-f9e3-4faf-8a7f-2c96f3d5a280,86601] - SURFACE TEMPERATURE [5a7bb095-4d12-4232-bc75-b8e82197cb92,86389]); delete broader relation (null);
definition: Temperature measured by the removal of ice through heating.
in scheme: sciencekeywords