S - U
type: Concept

USACORP/WES
type: Concept
definition: The United States Army Corps of Engineers (USACE) is made up of approximately 34,600 Civilian and 650 military members. Our military and civilian engineers, scientists and other specialists work hand in hand as leaders in engineering and environmental matters. Our diverse workforce of biologists, engineers, geologists, hydrologists, natural resource managers and other professionals meets the demands of changing times and requirements as a vital part of America's Army. Summary Provided By: http://www.usace.army.mil/who/
in scheme: projects