SEDIMENTARY ROCK AGE DETERMINATIONS
type: Concept
change note: 2013-03-22 08:38:07.0 [tbs1979] insert Definition (id: null text: An analysis and determination of the age of sedimentary rocks. language code: en);
change note: 2013-03-05 13:05:31.0 [tbs1979] Insert Concept add broader relation (SEDIMENTARY ROCK AGE DETERMINATIONS [701f2b6f-34b0-4f69-941e-c2c5545abc0b,83029] - SEDIMENTARY ROCKS [85353d7b-05d8-4c32-a5b2-065f1f22f026,61759]);
definition: An analysis and determination of the age of sedimentary rocks.
in scheme: sciencekeywords

SEDIMENTARY ROCKS
type: Concept