Chemical Meters/Analyzers
type: Concept

CAPS NO2 Analyzer
type: Concept
change note: 2020-11-12 16:14:20.0 [sritz] insert AltLabel (id: null category: primary text: Cavity Attenuated Phase Shift Nitrogen Dioxide Analyzer language code: en); insert Definition (id: null text: The T500U CAPS NO2 Analyzer represents the next generation of criteria pollutant monitoring technology for the direct measurement of Nitrogen Dioxide (NO2) in air. The instrument utilizes a patented Cavity Attenuated Phase Shift (CAPS) technique to provide an extremely sensitive, fast and accurate NO2 measurement in a cost effective and low maintenance instrument package. language code: en);
change note: 2020-11-12 16:13:24.0 [sritz] Insert Concept add broader relation (CAPS NO2 Analyzer [704ba472-0a31-414e-9d3d-6d1aa90335bd,560767] - Chemical Meters/Analyzers [3d25724b-832f-4a61-b0b2-4f2ccecdba94,543779]);
definition: The T500U CAPS NO2 Analyzer represents the next generation of criteria pollutant monitoring technology for the direct measurement of Nitrogen Dioxide (NO2) in air. The instrument utilizes a patented Cavity Attenuated Phase Shift (CAPS) technique to provide an extremely sensitive, fast and accurate NO2 measurement in a cost effective and low maintenance instrument package.
in scheme: instruments