PURDUE/FNR/HEMA
type: Concept
definition: The purpose of the Human-Environment Modeling and Analysis (HEMA) Laboratory in the Department of Forestry and Natural Resources at Purdue University s to support research in the area of coupled natural-human systems through the development and use of spatial models. We take a multidisciplinary approach to studying natural resource problems, combining expertise in GIS, remote sensing, simulation modeling and natural resource management. You can find information here on the models, tools and approaches that are being used to study human-environment interactions. In addition, you can find descriptions of funded projects, people working on the projects, lists of publications and presentations that have been produced in the lab. [Summary provided by Purdue University.]
in scheme: providers

ACADEMIC
type: Concept