Space Shuttle
type: Concept

Spacelab-3
type: Concept
change note: 2022-04-20 12:27:33.0 [tstevens] update PrefLabel (Spacelab-3);
change note: 2022-04-20 12:32:46.0 [tstevens] update Definition (The Spacelab 3 mission was the second flight of Spacelab, the reusable and versatile space laboratory developed for NASA by the European Space Agency (ESA); it was also the first NASA-dedicated Spacelab mission. The SL-3 crew consisted of Commander Robert F. Overmyer, Pilot Frederick D. Gregory, Mission Specialists Don L. Lind, Norman E. Thagard, and William E. Thornton, and Payload Specialists Lodewijk van den Berg and Taylor G. Wang. Rather than carrying experiments covering a broad range of disciplines as did Spacelab 1, the SL-3 payload investigations focused mainly on microgravity and included experiments in life sciences, materials science, fluid mechanics, and atmospheric and astronomical observations.);
change note: 2021-11-30 12:28:23.0 [tstevens] Move Concepts delete broader relation (null); add broader relation (SPACELAB-3 [70d24549-a5ef-47b1-8131-f5c48e7e93d4,826366] - SPACE SHUTTLE [3ef93fbf-1e19-42a9-a91f-502d125dbb7c,826168]);
change note: 2021-11-30 12:13:59.0 [tstevens] Move Concepts delete broader relation (null); add broader relation (SPACELAB-3 [70d24549-a5ef-47b1-8131-f5c48e7e93d4,826366] - Space Stations/Crewed Spacecraft [388e72a1-b851-4b78-9e69-747e06ae215f,826132]);
change note: 2021-11-30 12:08:53.0 [tstevens] Move Concepts delete broader relation (null); add broader relation (SPACELAB-3 [70d24549-a5ef-47b1-8131-f5c48e7e93d4,826366] - Space-based Platforms [b39a69b4-c3b9-4a94-b296-bbbbe5e4c847,835875]);
definition: The Spacelab 3 mission was the second flight of Spacelab, the reusable and versatile space laboratory developed for NASA by the European Space Agency (ESA); it was also the first NASA-dedicated Spacelab mission. The SL-3 crew consisted of Commander Robert F. Overmyer, Pilot Frederick D. Gregory, Mission Specialists Don L. Lind, Norman E. Thagard, and William E. Thornton, and Payload Specialists Lodewijk van den Berg and Taylor G. Wang. Rather than carrying experiments covering a broad range of disciplines as did Spacelab 1, the SL-3 payload investigations focused mainly on microgravity and included experiments in life sciences, materials science, fluid mechanics, and atmospheric and astronomical observations.
in scheme: platforms