GCIP
type: Concept
definition: The Global Energy and Water Cycle Experiment (GEWEX) Continental-scale International Project (GCIP) Integrated Systems Test (GIST) takes place in the Arkansas-Red River basins as a data system test prior to the start of the 5 year GCIP Enhanced Observing Period(1995-2000). GCIP Contact: Adrian Ritchie, Rayheon ITSS Global Hydrology and Climate Center (GHCC) 230 Sparkman Dr Huntsville, Alabama 35805 Phone:(256) 961-7815 Fax:(256) 961-7723 Email: adrian.ritchie&#64msfc.nasa.gov For more information, link to "http://ghrc.msfc.nasa.gov/gcip/sdsmoverview.html"
in scheme: projects

G - I
type: Concept