OCEAN OPTICS
type: Concept

ATTENUATION/TRANSMISSION
type: Concept
definition: Attenuation is the exponential loss of light intensity as light propagates through water. Attenuation is caused by absorption and scattering of light energy. Transmission is the measurement of the percentage of light received at a photo cell placed at fixed distances from a light source.
in scheme: sciencekeywords