CARTOSAT-2
type: Concept
alternative label: IRS-P7
change note: 2018-06-13 11:47:59.0 [mmorahan] insert AltLabel (id: null category: null text: IRS-P7 language code: en); insert Definition (id: null text: Cartosat-2 Series Satellite is the primary satellite carried by PSLV-C40. This remote sensing satellite is similar in configuration to earlier satellites in the series and is intended to augment data services to the users. The imagery sent by satellite will be useful for cartographic applications, urban and rural applications, coastal land use and regulation, utility management like road network monitoring, water distribution, creation of land use maps, change detection to bring out geographical and manmade features and various other Land Information System (LIS) as well as Geographical Information System (GIS) applications. PSLV-C40/Cartosat-2 Series Satellite Mission was launched on Jan 12, 2018 at 09:29 Hrs (IST) from SDSC SHAR, Sriharikota. language code: en);
change note: 2018-06-13 15:07:44.0 [mmorahan] delete AltLabel (null);
change note: 2018-06-14 05:28:21.0 [mmorahan] insert AltLabel (id: null category: null text: IRS-P7 language code: en);
change note: 2019-02-20 14:07:08.0 [mmorahan] insert WeightedRelation (id: null related concept uuid: 3a3c2498-8e0e-4138-b5a2-7c2a80e1b598 relationship type: null relationship value: null generated by: null);
change note: 2018-06-13 11:45:50.0 [mmorahan] Insert Concept add broader relation (CARTOSAT-2 [71ccf8e3-7b1f-418d-9bc0-0ead78ec75ee,367711] - CARTOSAT [b65c6b10-a648-4a7c-9af1-71506ed9bb13,345679]);
definition: Cartosat-2 Series Satellite is the primary satellite carried by PSLV-C40. This remote sensing satellite is similar in configuration to earlier satellites in the series and is intended to augment data services to the users. The imagery sent by satellite will be useful for cartographic applications, urban and rural applications, coastal land use and regulation, utility management like road network monitoring, water distribution, creation of land use maps, change detection to bring out geographical and manmade features and various other Land Information System (LIS) as well as Geographical Information System (GIS) applications. PSLV-C40/Cartosat-2 Series Satellite Mission was launched on Jan 12, 2018 at 09:29 Hrs (IST) from SDSC SHAR, Sriharikota.
in scheme: platforms

Cartosat
type: Concept