DOC/NOAA/NWS/PUB
type: Concept
definition: The National Weather Service in Pueblo, Colorado offers climatology data sets for Southeast and South Central Colorado, and encompasses the highest (Mt. Elbert, at 14,440 feet above sea level) and lowest ( Holly, at 3387 feet above sea level) elevations in Colorado. Website: "http://www.crh.noaa.gov/pub/" [Summary provided by NOAA]
in scheme: providers

NOAA
type: Concept