OCEAN BOTTOM PRESSURE
type: Concept
change note: 2021-05-20 14:27:57.0 [tstevens] update Definition (https://podaac.jpl.nasa.gov/dataset/TELLUS_GRFO_L3_JPL_RL06_OCN_v03);
change note: 2021-05-14 09:08:39.0 [tstevens] insert Definition (id: null text: The sum of the mass of the atmosphere and ocean in a "cylinder" above the seafloor. language code: en);
change note: 2021-05-14 09:08:12.0 [tstevens] Insert Concept add broader relation (OCEAN BOTTOM PRESSURE [73311948-541c-4960-ae2b-2e82a79aa621,606940] - OCEAN PRESSURE [bfa56100-6fb5-4e49-9633-298fa3b45508,603554]);
definition: The sum of the mass of the atmosphere and ocean in a "cylinder" above the seafloor.
in scheme: sciencekeywords

OCEAN PRESSURE
type: Concept