COMMERCIAL
type: Concept

PLACEWAYS
type: Concept
definition: Placeways' GIS–based analysis and visualization tools help you make informed, efficient decisions about land–use planning and resource management. CommunityViz® community planning software and the Placeways suite of GIS offerings, provide a real–time interactive environment of 3D visuals, intelligent maps and dynamic analysis tools. Explore Placeways and begin making better, faster decisions about the shape of our world.
in scheme: providers