Radar Sounders
type: Concept

PR-2
type: Concept
change note: 2016-09-09 15:54:14.0 [saritz] insert AltLabel (id: null text: Second Generation Precipitation Radar language code: en); insert Definition (id: null text: The Second Generation Precipitation Radar (PR-2) is a dual-frequency, Doppler, dual-polarization radar system that includes digital, real-time pulse compression, extremely compact RF electronics, and a large deployable dual-frequency cylindrical parabolic antenna subsystem. language code: en);
change note: 2016-09-09 15:53:02.0 [saritz] Insert Concept add broader relation (PR-2 [734f3eb4-2be6-4da4-8751-62f7b6d7eff4,277839] - Radar Sounders [6c5ca722-0bc7-4ccd-ad24-39b9d8710140,259115]);
definition: The Second Generation Precipitation Radar (PR-2) is a dual-frequency, Doppler, dual-polarization radar system that includes digital, real-time pulse compression, extremely compact RF electronics, and a large deployable dual-frequency cylindrical parabolic antenna subsystem.
in scheme: instruments