TTU/MTTU/PALEO
type: Concept
definition: Established in 1929, the Museum is an educational, scientific, cultural, and research element of Texas Tech University. It is a not-for-profit institution by virtue of being a part of Texas Tech University. The Museum's purpose is to support the academic and intellectual mission of Texas Tech University through the collection, preservation, documentation, and research of scientific and cultural material and to disseminate information about those collections and their scientific and cultural topics through exhibition, interpretation, and publication for primary, secondary, and higher education students, the scholarly community, and the general public. Summary Provided By: http://www.depts.ttu.edu/museumttu/about.html#mission
in scheme: providers

ACADEMIC
type: Concept