ISLAND
type: Concept
change note: 2013-04-01 08:45:45.0 [tbs1979] insert Definition (id: null text: Piece of sub-continental land that is surrounded by water. Very small islands such as emergent land features on atolls can be called islets, cays or keys. language code: en);
change note: 2013-02-18 10:37:01.0 [tbs1979] Insert Concept add broader relation (ISLAND [74caea9b-6023-438b-af3d-bb9d948036f1,82441] - FLUVIAL LANDFORMS [cb5193ab-2d7a-4b35-b7ec-f16ce78ae270,64131]);
definition: Piece of sub-continental land that is surrounded by water. Very small islands such as emergent land features on atolls can be called islets, cays or keys.
in scheme: sciencekeywords

FLUVIAL LANDFORMS
type: Concept