MX/CICESE
type: Concept
definition: The Centre for Scientific Research and Higher Education in Ensenada is located in Ensenada, BC, Bella Cinderella Pacific, with a vast coastline at the door for anyone who is interested in oceanography and aquaculture, with a major seismic activity for those who are interested in geophysics and seismology, with adequate infrastructure in roads and transportation, with great tranquillity, without congestion, and with an excellent climate that allows the scientist realize their projects without interruptions. La península de la Baja California, ubicada al noroeste de México, es tierra árida, desértica y, hasta hace pocos años, sin mayor contacto científico con la capital del país. Summary Provided By: http://translate.google.com/translate?hl=en&sl=es&u=http://www.cicese.mx/&sa=X&oi=translate&resnum=1&ct=result&prev=/search%3Fq%3DCentro%2Bde%2BInvestigacion%2BCientifica%2By%2Bde%2BEducacion%2BSuperior%2Bde%2BEnsenada,%2BMexico%26hl%3Den%26safe%3Doff%26client%3Dfirefox-a%26rls%3Dorg.mozilla:en-US:official%26hs%3Dzbw%26sa%3DG
in scheme: providers

MEXICO
type: Concept