SLAP
type: Concept
change note: 2017-10-19 11:48:03.0 [sritz] update Definition (The SLAP instrument on Langley’s King Air aircraft is an aircraft scale simulator of the instruments that were planned to be mounted on NASA’s upcoming Soil Moisture Active Passive (SMAP) mission, which collects soil moisture measurements for ground validation. SLAP has both passive (radiometer) and active (radar) microwave L-band imaging capabilities, just as SMAP.);
change note: 2017-10-19 11:46:08.0 [sritz] insert AltLabel (id: null category: primary text: Scanning L-band Active Passive language code: en); insert Definition (id: null text: The SLAP instrument on Langley’s King Air aircraft is an aircraft scale simulator of the instruments that were planned to be mounted on NASA’s upcoming Soil Moisture Active Passive (SMAP) mission, which collects soil moisture measurements for ground validation. SLAP has both passive (radiometer) and active (radar) microwave L-band imaging capabilities, just as SMAP. language code: en);
change note: 2017-10-19 11:45:06.0 [sritz] Insert Concept add broader relation (SLAP [752d166c-5834-4fdc-968c-f69425b31ae5,310261] - Imaging Spectrometers/Radiometers [944b7691-af37-4fb4-9393-c114e7997829,290619]);
definition: The SLAP instrument on Langley’s King Air aircraft is an aircraft scale simulator of the instruments that were planned to be mounted on NASA’s upcoming Soil Moisture Active Passive (SMAP) mission, which collects soil moisture measurements for ground validation. SLAP has both passive (radiometer) and active (radar) microwave L-band imaging capabilities, just as SMAP.
in scheme: instruments

Imaging Spectrometers/Radiometers
type: Concept