LAND RECORDS
type: Concept

ISOTOPES
type: Concept
change note: 2012-07-23 17:17:24.0 [mpmorahan] insert Definition (id: null text: The isotopic record found in various non-marine records reveal direct information about the past climate. d18O (delta oxygen-18), 16O and 18O are isotopes of oxygen with slight differences in atomic weight. Studies using other isotopes such as Carbon-13, Carbon-14 and Hydrogen are widely used. Isotopic analysis is especially important in dendroclimatologic and speleothem analyses. language code: en);
change note: 2012-06-26 14:44:44.0 [gee-cee] Insert Concept add broader relation (ISOTOPES [7557eddd-db2a-4f39-b1e2-91162f4fc92e,39999] - LAND RECORDS [2bedb6b3-6e92-42e2-b382-60e2a6aab8e9,39979]);
definition: The isotopic record found in various non-marine records reveal direct information about the past climate. d18O (delta oxygen-18), 16O and 18O are isotopes of oxygen with slight differences in atomic weight. Studies using other isotopes such as Carbon-13, Carbon-14 and Hydrogen are widely used. Isotopic analysis is especially important in dendroclimatologic and speleothem analyses.
in scheme: sciencekeywords