Spectrometers
type: Concept

SPEC HVPS
type: Concept
change note: 2020-07-20 08:33:42.0 [tstevens] insert AltLabel (id: null category: primary text: SPEC High Volume Precipitation Spectrometer language code: en); insert Definition (id: null text: The High Volume Precipitation Spectrometer combines 2D-S opto-electronics with HVPS optics and probe tips designed to minimize shattering. language code: en);
change note: 2020-07-20 08:31:24.0 [tstevens] Insert Concept add broader relation (SPEC HVPS [756151d4-36d6-427e-99c1-cb012196a3ef,560532] - Spectrometers [055a79c7-61db-4250-abad-f1e09909f14c,543071]);
definition: The High Volume Precipitation Spectrometer combines 2D-S opto-electronics with HVPS optics and probe tips designed to minimize shattering.
in scheme: instruments