SENSE
type: Concept
change note: 2019-05-06 08:27:33.0 [mmorahan] insert Definition (id: null text: SENSE is a receiver for AIS (Automatic Identification System) signal reception from ships at sea, providing worldwide tracking (identification, position, course and speed information) plus detailed vessel characteristics for maritime safety. language code: en); insert WeightedRelation (id: null related concept uuid: da278af5-097b-47e7-903d-4deac395c4de relationship type: null relationship value: null generated by: null);
change note: 2019-05-06 08:25:58.0 [mmorahan] Insert Concept add broader relation (SENSE [75a145eb-0fed-4011-90db-286010e10fb0,368781] - Imaging Spectrometers/Radiometers [944b7691-af37-4fb4-9393-c114e7997829,347979]);
definition: SENSE is a receiver for AIS (Automatic Identification System) signal reception from ships at sea, providing worldwide tracking (identification, position, course and speed information) plus detailed vessel characteristics for maritime safety.
in scheme: instruments

Imaging Spectrometers/Radiometers
type: Concept