AUSTRALIA
type: Concept

AU/BOM/WARO
type: Concept
definition: This data center is the Western Australian Regional Office of the Bureau of Meteorology which provides many of the same meteorological services as the other regional centers. Website: "http://www.bom.gov.au/weather/wa/"
in scheme: providers