GREEN ALGAE
type: Concept
change note: 2017-03-15 11:25:35.0 [mgenazzi] Definition added insert Definition (id: null text: Green algae are distinguished by chlorophyll a and b proportions, accessory pigments beta-carotene, and xanthophylls in stacked thylakoids. Cell walls are typically cellulose and they store carbohydrates as starch language code: en);
definition: Green algae are distinguished by chlorophyll a and b proportions, accessory pigments beta-carotene, and xanthophylls in stacked thylakoids. Cell walls are typically cellulose and they store carbohydrates as starch
in scheme: sciencekeywords

MACROALGAE (SEAWEEDS)
type: Concept