Swarm
type: Concept

Swarm-C
type: Concept
change note: 2020-07-15 12:29:28.0 [mmorahan] insert WeightedRelation (id: null related concept uuid: 0bdca141-ccec-471e-9dd9-f47d3a94abf7 relationship type: null relationship value: null generated by: null);
change note: 2018-06-13 08:07:25.0 [mmorahan] Insert Concept add broader relation (Swarm-C [769a52d4-7db1-4b8e-8d39-6fee4e74d34f,367707] - Swarm [1d6d5f82-acd5-4bd2-9324-12884718b353,367695]);
change note: 2019-02-22 16:44:33.0 [mmorahan] insert WeightedRelation (id: null related concept uuid: b7bc737c-15de-4b67-9bc3-5fa7c2b651d5 relationship type: null relationship value: null generated by: null); insert WeightedRelation (id: null related concept uuid: 5e95a04f-e746-4b55-b0f0-76631bb197fe relationship type: null relationship value: null generated by: null); insert WeightedRelation (id: null related concept uuid: e5fde4c4-15cd-4278-b922-005488df096f relationship type: null relationship value: null generated by: null); insert WeightedRelation (id: null related concept uuid: 2380ecc6-b5ae-4ad8-a56a-9740166465aa relationship type: null relationship value: null generated by: null); insert WeightedRelation (id: null related concept uuid: 03d748ff-7398-4ea8-87e7-38d0ef3e6167 relationship type: null relationship value: null generated by: null);
change note: 2019-02-22 16:48:47.0 [mmorahan] insert Definition (id: null text: Primary objectives: * studies of core dynamics, geodynamo processes and core-mantle interaction * mapping of the lithospheric magnetisation and its geological interpretation * determination of the 3D electrical conductivity of the mantle * investigation of electric currents flowing in the magnetosphere and ionosphere * identifying the ocean circulation by its magnetic signature * quantifying the magnetic forcing of the upper atmosphere language code: en);
definition: Primary objectives: * studies of core dynamics, geodynamo processes and core-mantle interaction * mapping of the lithospheric magnetisation and its geological interpretation * determination of the 3D electrical conductivity of the mantle * investigation of electric currents flowing in the magnetosphere and ionosphere * identifying the ocean circulation by its magnetic signature * quantifying the magnetic forcing of the upper atmosphere
in scheme: platforms