ORAU/ORISE
type: Concept
change note: 2015-01-16 16:57:09.0 [sgrebas] insert AltLabel (id: null text: Oak Ridge Institute for Science and Education, Oak Ridge Associated Universities language code: en);
change note: 2015-01-16 16:56:30.0 [sgrebas] Insert Concept add broader relation (ORAU/ORISE [76e82eca-8e26-4cea-8938-488f2f988e57,106701] - CONSORTIA/INSTITUTIONS [aef2fc80-def0-46a4-9259-9dc37e80ed08,66451]);
definition: The Oak Ridge Institute for Science and Education (ORISE) is a U.S. Department of Energy (DOE) institute managed by Oak Ridge Associated Universities (ORAU). ORISE addresses national needs by: -Assessing and analyzing environmental and health effects of radiation, beryllium and other hazardous materials; -Maintaining medical and national security radiation emergency management and response capabilities; and -Managing education programs to help ensure a robust supply of scientists, engineers and technicians to meet future science and technology needs. ORISE creates opportunities for collaboration through partnerships with other DOE facilities, federal agencies, academia and industry in a manner consistent with DOE objectives and the ORISE mission. In alignment with the mission, ORISE’s capabilities are divided into seven programmatic areas: -Science Education -National Security and Emergency Management -Radiation Emergency Medicine -Occupational Exposure and Worker Health -Health Communication and Technical Training -Scientific and Technical Resource Integration -Independent Environmental Assessment and Verification
in scheme: providers

CONSORTIA/INSTITUTIONS
type: Concept