OCEAN CURRENTS
type: Concept

SPEED PROFILES
type: Concept
change note: 2021-10-20 09:17:04.0 [tstevens] insert Definition (id: null text: Ocean current velocity throughout the water column. language code: en);
change note: 2021-10-20 09:15:38.0 [tstevens] Insert Concept add broader relation (SPEED PROFILES [7744f889-b25e-4d0e-bcf6-d94cbf63df22,778208] - OCEAN CURRENTS [510c5f78-e19e-4ce4-b59a-8937aeb84631,776111]);
definition: Ocean current velocity throughout the water column.
in scheme: sciencekeywords