Sentinel-5P
type: Concept
change note: 2019-02-22 15:03:26.0 [mmorahan] insert WeightedRelation (id: null related concept uuid: 74ee2866-0e9e-4c20-8003-0621af6552f3 relationship type: null relationship value: null generated by: null);
change note: 2020-06-18 16:45:52.0 [mmorahan] Move Concepts delete broader relation (null); add broader relation (Sentinel-5P [77e9a75e-2c3b-428b-8b21-b6a902dd8fee,541991] - Sentinel-5 [dc626ae7-1ebe-4b9d-9b73-c048fa92434f,560376]);
change note: 2020-06-18 16:46:41.0 [mmorahan] insert AltLabel (id: null category: primary text: Sentinel-5 Precursor language code: en);
change note: 2018-10-04 14:35:15.0 [mmorahan] insert Definition (id: null text: A precursor satellite mission, Sentinel-5P aims to fill in the data gap and provide data continuity between the retirement of the Envisat satellite and NASA's Aura mission and the launch of Sentinel-5. The mission will perform atmospheric monitoring and was launched in October 2017. Launch Date: 13 October 2017 Operational lifespan: 7 years Mission Objectives: The Sentinel-5 Precursor objectives are to provide operational space-borne observations in support to the operational monitoring of: Air Quality Ozone and Surface UV Climate It will provide measurements of: Ozone NO_2 SO_2 Formaldehyde Aerosol Carbonmonoxide Methane Clouds Mission Orbit: Orbit Type: Sun-synchronous, polar Orbit Height: 824 km Inclination: 98.74° Repeat Cycle: 16 days Mean LST: 13:30 at Ascending Node Sentinel-5 Precursor is foreseen to operate in loose formation with Suomi-NPP Payload: The TROPOMI instrument is a UV-VIS-NIR-SWIR push-broom grating spectrometer. Spectral range: 270-495 nm, 710-775 nm, 2305-2385 nm Spectral resolution: 0.25-0.55 nm Observation mode: nadir pointing, global daily coverage, 7x7 km^2 ground Payload Mass: 200kg Configuration: The spacecraft launch mass is ~900 kg Launch vehicle: ROCKOT Contractors: Prime Contractor: Airbus Defence & Space TROPOMI contract: Dutch Ministry of Economic Affairs language code: en);
change note: 2018-10-04 14:31:20.0 [mmorahan] Insert Concept add broader relation (Sentinel-5P [77e9a75e-2c3b-428b-8b21-b6a902dd8fee,368151] - Earth Observation Satellites [3466eed1-2fbb-49bf-ab0b-dc08731d502b,344761]);
definition: A precursor satellite mission, Sentinel-5P aims to fill in the data gap and provide data continuity between the retirement of the Envisat satellite and NASA's Aura mission and the launch of Sentinel-5. The mission will perform atmospheric monitoring and was launched in October 2017. Launch Date: 13 October 2017 Operational lifespan: 7 years Mission Objectives: The Sentinel-5 Precursor objectives are to provide operational space-borne observations in support to the operational monitoring of: Air Quality Ozone and Surface UV Climate It will provide measurements of: Ozone NO_2 SO_2 Formaldehyde Aerosol Carbonmonoxide Methane Clouds Mission Orbit: Orbit Type: Sun-synchronous, polar Orbit Height: 824 km Inclination: 98.74° Repeat Cycle: 16 days Mean LST: 13:30 at Ascending Node Sentinel-5 Precursor is foreseen to operate in loose formation with Suomi-NPP Payload: The TROPOMI instrument is a UV-VIS-NIR-SWIR push-broom grating spectrometer. Spectral range: 270-495 nm, 710-775 nm, 2305-2385 nm Spectral resolution: 0.25-0.55 nm Observation mode: nadir pointing, global daily coverage, 7x7 km^2 ground Payload Mass: 200kg Configuration: The spacecraft launch mass is ~900 kg Launch vehicle: ROCKOT Contractors: Prime Contractor: Airbus Defence & Space TROPOMI contract: Dutch Ministry of Economic Affairs
in scheme: platforms

Sentinel-5
type: Concept