Campbell Scientific 107
type: Concept
change note: 2021-05-12 09:38:07.0 [tstevens] insert AltLabel (id: null category: primary text: Campbell Scientific 107 Temperature Probe language code: en); insert Definition (id: null text: The 107 is a rugged, accurate probe that measures temperature of air, soil, or water from -35° to +50°C. It easily interfaces with most Campbell Scientific data loggers and can be used in a variety of applications. The 107 consists of a thermistor encapsulated in an epoxy-filled aluminum housing. The housing protects the thermistor, allowing you to bury the probe in soil or submerge it in water. language code: en);
change note: 2021-05-12 09:36:59.0 [tstevens] Insert Concept add broader relation (Campbell Scientific 107 [78bf23df-51db-490c-adf7-891a97b5f0bc,606934] - Probes [def72d78-3c2f-4f46-91e7-259a0e63e2de,599699]);
definition: The 107 is a rugged, accurate probe that measures temperature of air, soil, or water from -35° to +50°C. It easily interfaces with most Campbell Scientific data loggers and can be used in a variety of applications. The 107 consists of a thermistor encapsulated in an epoxy-filled aluminum housing. The housing protects the thermistor, allowing you to bury the probe in soil or submerge it in water.
in scheme: instruments

Probes
type: Concept