SWELLS
type: Concept

SWELL PERIOD
type: Concept
change note: 2021-10-20 15:07:24.0 [tstevens] insert Definition (id: null text: This is the peak period in seconds of the swells. If more than one swell is present, this is the period of the swell containing the maximum energy. language code: en);
change note: 2021-10-20 15:06:42.0 [tstevens] Insert Concept add broader relation (SWELL PERIOD [7a8920f3-e531-47e0-bb23-a9f816cfb7bf,778220] - SWELLS [4e4d3c18-cdd4-474a-a936-6e127ec526f7,776184]);
definition: This is the peak period in seconds of the swells. If more than one swell is present, this is the period of the swell containing the maximum energy.
in scheme: sciencekeywords