CA/PEI/EEF
type: Concept
definition: InfoPEI is a comprehensive reference source to life on Prince Edward Island. With information on everything from fire departments to hiking trails, we have attempted to include any and all information that might be of use to someone living, vacationing, working, and learning on Prince Edward Island.
in scheme: providers

CANADA
type: Concept