Permanent Land Sites
type: Concept

STREAMFLOW STATION
type: Concept
change note: 2022-02-11 09:26:40.0 [tstevens] update Definition (The USGS, in cooperation with more than 800 state, local and other federal agencies, operates approximately 7,000 continuously active streamflow measurement and data collection sites, called streamgages. Almost 5,000 of the USGS's approximately 7,000 streamgages are equipped with telemetry that transmits a reading of stream depth ("stage") to a district office via satellite or telephone. This "realtime" data is used for a multiplicity of purposes: including flood hazard mitigation by the National Weather Service, the U.S. Army Corps of Engineers, and the Federal Emergency Management Agency; and for resource planning, and infrastructure design of reservoirs and dams.);
change note: 2021-11-18 08:22:26.0 [tstevens] Move Concepts delete broader relation (null); add broader relation (STREAMFLOW STATION [7b335954-929b-4568-a758-1640d15c2504,826403] - Permanent Land Sites [0ec10fd9-492c-498a-b6d8-e2840cc3643b,835887]);
change note: 2021-07-23 17:19:57.0 [sritz] insert AltLabel (id: null category: primary text: STREAMFLOW STATION language code: en);
definition: The USGS, in cooperation with more than 800 state, local and other federal agencies, operates approximately 7,000 continuously active streamflow measurement and data collection sites, called streamgages. Almost 5,000 of the USGS's approximately 7,000 streamgages are equipped with telemetry that transmits a reading of stream depth ("stage") to a district office via satellite or telephone. This "realtime" data is used for a multiplicity of purposes: including flood hazard mitigation by the National Weather Service, the U.S. Army Corps of Engineers, and the Federal Emergency Management Agency; and for resource planning, and infrastructure design of reservoirs and dams.
in scheme: platforms