OCEANOGRAFIA BIOLOGICA
type: Concept
definition: A oceanografia biológica estuda a biota e a ecologia dos oceanos, buscando compreender os mecanismos biológicos que funcionam nos oceanos. A oceanografia biológica difere da biologia marinha por estudar os organismos marinhos com um enfoque mais ecológico, relacionado com a física, a química e a geologia do oceano. Na oceanografia biológica se dividem os organismos marinhos em três categorias: plâncton, nécton e bentos. O plâncton é formado pelos organismos que vivem na coluna de água sem conseguirem nadar contra as correntes marinhas. O nécton é constituído pelos organismos que tem boa capacidade natatória, não dependendo de correntes para se deslocarem. O bentos é formado pelos organismos que vivem no substrato, fixados ou não. Information provided by http://pt.wikipedia.org/wiki/Oceanografia#Oceanografia_Biol.C3.B3gica
in scheme: projects

M - O
type: Concept