USGS
type: Concept

DOI/USGS/WRD/PUB/OFR
type: Concept
definition: The online server http://water.usgs.gov/pubs/of/ is now holding many USGS files on Water Resources. Most of the publications are located on this site and on other USGS sites located by subject, author, or date. The files on Water Resources hold information from the years of 1978-2005. Website: http://water.usgs.gov/pubs/of/ [Summary provided by the USGS.]
in scheme: providers