OWI-430 DSP-WIVIS
type: Concept
change note: 2021-06-08 09:19:48.0 [tstevens] insert Definition (id: null text: The OWI-430 DSP-WIVIS is the most advanced present weather and visibility sensor ever made. The fully automated instrument provides accurate visibility, present weather and precipitation measurement in a single sensor. This next generation intelligent sensor uses all digital signal processing (DSP) for no-drift high-accuracy results. OSi’s patented environmentally adaptive algorithms use artificial-intelligence technology derived from over 100 million field hours of real-world data from our sensors installed around the world. The result is the most advanced weather sensor in the world. language code: en);
change note: 2021-06-08 09:20:29.0 [tstevens] update Definition (The OWI-430 DSP-WIVIS is the most advanced present weather and visibility sensor ever made. The fully automated instrument provides accurate visibility, present weather and precipitation measurement in a single sensor. This next generation intelligent sensor uses all digital signal processing (DSP) for no-drift high-accuracy results. OSi’s patented environmentally adaptive algorithms use artificial-intelligence technology derived from over 100 million field hours of real-world data from our sensors installed around the world. The result is the most advanced weather sensor in the world.);
change note: 2021-06-08 09:14:59.0 [tstevens] Insert Concept add broader relation (OWI-430 DSP-WIVIS [7bb9e493-f4ec-4f66-8db1-c98cfefc2eb3,635346] - Photon/Optical Detectors [8143e95e-a438-4a2a-82b2-6d7ae079fba7,627476]);
change note: 2021-06-08 09:15:56.0 [tstevens] insert AltLabel (id: null category: primary text: OWI-430 DSP-WIVIS Present Weather and Visibility Sensor language code: en);
definition: The OWI-430 DSP-WIVIS is the most advanced present weather and visibility sensor ever made. The fully automated instrument provides accurate visibility, present weather and precipitation measurement in a single sensor. This next generation intelligent sensor uses all digital signal processing (DSP) for no-drift high-accuracy results. OSi’s patented environmentally adaptive algorithms use artificial-intelligence technology derived from over 100 million field hours of real-world data from our sensors installed around the world. The result is the most advanced weather sensor in the world.
in scheme: instruments

Photon/Optical Detectors
type: Concept