CA/NS/FISH/IDBSB/MSD
type: Concept
definition: The Marketing Services Division delivers expert marketing advice and information to clients in the Nova Scotia agri-food and seafood industry. Our programs and services are designed to enhance the competitiveness and value of the sector through the identification, development and promotion of domestic and international market opportunities. Website: "http://www.gov.ns.ca/nsaf/marketing/index.htm" [Summary provided by Nova Scotia Department of Agriculture and Fisheries, Industry Development and Business Services Branch, Marketing Services Division.]
in scheme: providers

CANADA
type: Concept