Chemical Meters/Analyzers
type: Concept

GAS CORRELATION FILTERS
type: Concept
change note: 2021-08-05 12:00:32.0 [sritz] insert AltLabel (id: null category: primary text: GAS CORRELATION FILTERS language code: en);
definition: GAS CORRELATION FILTERS are a form of nondispersive infrared spectrometry that takes advantage of the banded nature of gas-phase infrared spectra.
in scheme: instruments