MULTINATIONAL ORGANIZATIONS
type: Concept

UN/FAO/GTOS
type: Concept
definition: The Global Terrestrial Observing System (GTOS) is a programme for observations, modelling, and analysis of terrestrial ecosystems to support sustainable development. GTOS facilitates access to information on terrestrial ecosystems so that researchers and policy makers can detect and manage global and regional environmental change. Website: "http://www.fao.org/gtos/" [Summary provided by GTOS.]
in scheme: providers