Spectrometers/Radiometers
type: Concept

3D-IMAGER
type: Concept
change note: 2014-06-12 13:17:15.0 [mpmorahan] Insert Concept add broader relation (3D-IMAGER [7d8a1068-e9a0-4698-89c4-d136a08fffa4,106465] - Spectrometers/Radiometers [2e38423f-a5e6-411a-88d3-8fdc00aaf30a,75405]);
definition: The INSAT-3D imager provides imaging capability of the earth disc from geostationary altitude in one visible (0.52 - 0.72 micrometers) and five infrared; 1.55 - 1.70(SWIR), 3.80 - 4.00(MIR), 6.50 - 7.00 (water vapour), 10.2 - 11.2 (TIR-1) and 11.5 - 12.5 (TIR-2) bands. The ground resolution at the sub-satellite point is nominally 1km x 1km for visible and SWIR bands, 4km x 4km for one MIR and both TIR bands and 8km x 8km for WV band. Group: Instrument_Details Entry_ID: 3D-IMAGER Group: Instrument_Identification Instrument_Category: Earth Remote Sensing Instruments Instrument_Class: Passive Remote Sensing Instrument_Type: Spectrometers/Radiometers Short_Name: 3D-IMAGER End_Group Group: Instrument_Associated_Sensors Short_Name: 3D-IMAGER End_Group Group: Associated_Platforms Short_Name: INSAT-3D End_Group Group: Spectral_Frequency_Information Wavelength_Keyword: INFRARED > THERMAL Number_Channels: 1 Spectral_Frequency_Coverage_Range: 10.30-11.30 Spectral_Frequency_Resolution: 1.0 End_Group Group: Spectral_Frequency_Information Wavelength_Keyword: INFRARED > THERMAL Number_Channels: 1 Spectral_Frequency_Coverage_Range: 11.50-12.50 Spectral_Frequency_Resolution: 1.0 End_Group Group: Spectral_Frequency_Information Wavelength_Keyword: VISIBLE Number_Channels: 1 Spectral_Frequency_Coverage_Range: 0.55-0.75 Spectral_Frequency_Resolution: 0.20 End_Group Group: Spectral_Frequency_Information Wavelength_Keyword: VISIBLE Number_Channels: 1 Spectral_Frequency_Coverage_Range: 1.55-1.70 Spectral_Frequency_Resolution: 0.15 End_Group Group: Spectral_Frequency_Information Wavelength_Keyword: INFRARED > REFLECTED Number_Channels: 1 Spectral_Frequency_Coverage_Range: 3.80-4.00 Spectral_Frequency_Resolution: 0.20 End_Group Group: Spectral_Frequency_Information Wavelength_Keyword: INFRARED > REFLECTED Number_Channels: 1 Spectral_Frequency_Coverage_Range: 6.50-7.10 Spectral_Frequency_Resolution: 0.60 End_Group Online_Resource: http://www.isro.gov.in/satellites/insat-3d.aspx Sample_Image: …
in scheme: instruments