MSR
type: Concept
change note: 2021-06-04 07:49:20.0 [tstevens] insert AltLabel (id: null category: primary text: U.S. Department of State Marine Scientific Research language code: en); insert Definition (id: null text: OPA promotes science and diplomacy, improves maritime domain awareness, and safeguards the interests of the U.S. scientific community through the marine scientific research consent program. Annually, OPA facilitates diplomatic marine scientific research consent for U.S. scientists to conduct more than 300 hundred research cruises in over 70 coastal states. OPA manages the review process which issues consent to dozens of foreign scientists a year to conduct research in U.S. waters. language code: en);
change note: 2021-06-04 07:47:16.0 [tstevens] Insert Concept add broader relation (MSR [7f20589c-650d-4550-b04d-8879e1fb7224,635339] - M - O [a31c2828-9b6d-44e9-b6ad-7ae81030f322,629594]);
definition: OPA promotes science and diplomacy, improves maritime domain awareness, and safeguards the interests of the U.S. scientific community through the marine scientific research consent program. Annually, OPA facilitates diplomatic marine scientific research consent for U.S. scientists to conduct more than 300 hundred research cruises in over 70 coastal states. OPA manages the review process which issues consent to dozens of foreign scientists a year to conduct research in U.S. waters.
in scheme: projects

M - O
type: Concept