COMMERCIAL
type: Concept

REGENT
type: Concept
definition: Founded in 1991, Regent Instruments Inc. sells image analysis systems for plant and forestry research. Regent Instruments systems are used in more than 68 countries in a variety of disciplines including: agronomy, biotechnology, botany, ecology, forestry and many more. Specialized software / general hardware is the philosophy behind Regent Instruments. Regent Instruments relies on a dynamic team of engineers, agronomists and microbiologists. Our close cooperation with universities, government agencies and private companies from all over the world allows us to fully understand our clients' needs. Summary Provided By: http://www.regentinstruments.com/
in scheme: providers