USGS
type: Concept

DOI/USGS/GD/EHP/NEIC
type: Concept
definition: This web site is provided by the United States Geological Survey’s (USGS) Earthquake Hazards Program as part of our effort to reduce earthquake hazard in the United States. We are part of the USGS Geologic Discipline and are the USGS component of the congressionally established, multi-agency National Earthquake Hazards Reduction Program (NEHRP). The USGS participates in the NEHRP with the Federal Emergency Management Agency (FEMA), the National Institute of Standards and Technology (NIST), and the National Science Foundation (NSF). In the 2004 reauthorization of NEHRP by Congress, NIST has been given the lead role to plan and coordinate this national effort to mitigate earthquake losses by developing and applying earth science data and assessments essential for land-use planning, engineering design, and emergency preparedness decisions. Earthquakes pose significant risk to 75 million Americans in 39 States. The USGS is the only Federal agency with responsibility for recording and reporting earthquake activity nationwide. Citizens, emergency responders, and engineers rely on the USGS for accurate and timely information on where an earthquake occurred, how much the ground shook in different locations, and what the likelihood is of future significant ground shaking. Summary provided by http://neic.usgs.gov/neis/eq_depot/2002/eq_021103/
in scheme: providers