PYROCUMULUS
type: Concept
change note: 2013-03-21 13:31:56.0 [mpmorahan] insert Definition (id: null text: A cumulus cloud formed by a rising thermal from a fire, or enhanced by buoyant plume emissions from an industrial combustion process. language code: en);
change note: 2013-02-14 09:59:36.0 [mpmorahan] Insert Concept add broader relation (PYROCUMULUS [801846d5-622b-4937-83cf-9d387be73ac4,82229] - CUMULUS [e1dff4d5-2e5b-46e7-9804-9de29fdb36d9,82215]);
definition: A cumulus cloud formed by a rising thermal from a fire, or enhanced by buoyant plume emissions from an industrial combustion process.
in scheme: sciencekeywords

CUMULUS
type: Concept