SPECIES/POPULATION INTERACTIONS
type: Concept

NATURAL SELECTION
type: Concept
definition: Selection, or natural selection, is a nonrandom reproduction of genotypes that results in the survival of those best adapted to their environment and elimination of those less well adapted. Selection leads to evolutionary change.
in scheme: sciencekeywords