Earth Observation Satellites
type: Concept

Improved TIROS Operational Satellite (ITOS)
type: Concept
change note: 2018-10-30 13:20:07.0 [sritz] insert Definition (id: null text: The Improved TIROS Operational Satellite (ITOS) inaugurated the second generation of a space-based system to provide continuous, day-to-day observations of the Earth's weather systems. ITOS launched a total of six satellites from 1970 through 1976, continuing the mission of the TIROS and the TIROS Operational Satellite programs. ITOS flew in a polar, sun-synchronous orbit and used improved stabilization techniques that allowed the spacecraft always to point its cameras and other sensors at the Earth. The satellite carried Automatic Picture Transmission cameras to provide instant weather data to ground stations around the world; Advanced Vidicon Camera Subsystems for detailed observations; and scanning radiometers for imaging the earth at night. language code: en);
change note: 2021-12-02 09:27:16.0 [tstevens] update PrefLabel (Improved TIROS Operational Satellite (ITOS));
change note: 2018-10-30 13:18:47.0 [sritz] Insert Concept add narrower relation (ITOS [80e95a88-b44e-444e-bd79-2e6dbb56b170,368215] - ITOS-1 [b080d2a3-c089-4ddf-bbfb-3e24495413b3,368219]);
change note: 2018-10-30 13:18:11.0 [sritz] Insert Concept add broader relation (ITOS [80e95a88-b44e-444e-bd79-2e6dbb56b170,368215] - Earth Observation Satellites [3466eed1-2fbb-49bf-ab0b-dc08731d502b,344761]);
definition: The Improved TIROS Operational Satellite (ITOS) inaugurated the second generation of a space-based system to provide continuous, day-to-day observations of the Earth's weather systems. ITOS launched a total of six satellites from 1970 through 1976, continuing the mission of the TIROS and the TIROS Operational Satellite programs. ITOS flew in a polar, sun-synchronous orbit and used improved stabilization techniques that allowed the spacecraft always to point its cameras and other sensors at the Earth. The satellite carried Automatic Picture Transmission cameras to provide instant weather data to ground stations around the world; Advanced Vidicon Camera Subsystems for detailed observations; and scanning radiometers for imaging the earth at night.
in scheme: platforms

ITOS-1
type: Concept