COMMERCIAL
type: Concept

KOSMOS
type: Concept
definition: Goliath is The Gale Group, a part of Cengage Learning's online-business content service, providing global company and industry intelligence to business executives. Goliath provides immediate online access to more than five million records including business articles, industry reports, company profiles and executive contacts pulled from business data resources maintained by The Gale Group. The site serves a range of business needs - from starting a company, to researching an existing company and reviewing best practices, to retrieving recent business news. Summary Provided By: http://goliath.ecnext.com/coms2/page_about
in scheme: providers